Reaction Details
TargetSodium-dependent serotonin transporter
LigandBDBM50294282
Substrate/Competitorn/a
Meas. Tech.ChEMBL_575206 (CHEMBL1024553)
IC50 16±n/a nM
Citation Fish, PVAndrews, MDJonathan Fray, MStobie, AWakenhut, FWhitlock, GA 4-Piperidines and 3-pyrrolidines as dual serotonin and noradrenaline reuptake inhibitors: design, synthesis and structure-activity relationships. Bioorg Med Chem Lett19:2829-34 (2009) 
 
Sodium-dependent serotonin transporter
Name:Sodium-dependent serotonin transporter
Type:Multi-pass membrane protein
Mol. Mass.:70322.51
Organism:Homo sapiens (Human)
Description:P31645
Residue:630
BDBM50294282
NameBDBM50294282
Synonyms:CHEMBL556268 | rac-2-((2,3-dichloro-5-methylphenoxy)(piperidin-4-yl)methyl)pyridine
TypeSmall organic molecule
Emp. Form.C18H20Cl2N2O
Mol. Mass.351.27
SMILESCc1ccc(nc1)C(Oc1cccc(Cl)c1Cl)C1CCNCC1