Reaction Details
TargetSodium-dependent noradrenaline transporter
LigandBDBM50294286
Substrate/Competitorn/a
Meas. Tech.ChEMBL_575205 (CHEMBL1024552)
IC50 9.00±n/a nM
Citation Fish, PVAndrews, MDJonathan Fray, MStobie, AWakenhut, FWhitlock, GA 4-Piperidines and 3-pyrrolidines as dual serotonin and noradrenaline reuptake inhibitors: design, synthesis and structure-activity relationships. Bioorg Med Chem Lett19:2829-34 (2009) 
 
Sodium-dependent noradrenaline transporter
Name:Sodium-dependent noradrenaline transporter
Type:Multi-pass membrane protein
Mol. Mass.:69337.72
Organism:Homo sapiens (Human)
Description:P23975
Residue:617
BDBM50294286
NameBDBM50294286
Synonyms:3-((2,3-dichlorophenoxy)((R)-piperidin-3-yl)methyl)pyridine | CHEMBL549825
TypeSmall organic molecule
Emp. Form.C17H18Cl2N2O
Mol. Mass.337.244
SMILESClc1cccc(OC([C@@H]2CCCNC2)c2cccnc2)c1Cl