Reaction Details
TargetSodium-dependent noradrenaline transporter
LigandBDBM50294256
Substrate/Competitorn/a
Meas. Tech.ChEMBL_575205 (CHEMBL1024552)
IC50 44±n/a nM
Citation Fish, PVAndrews, MDJonathan Fray, MStobie, AWakenhut, FWhitlock, GA 4-Piperidines and 3-pyrrolidines as dual serotonin and noradrenaline reuptake inhibitors: design, synthesis and structure-activity relationships. Bioorg Med Chem Lett19:2829-34 (2009) 
 
Sodium-dependent noradrenaline transporter
Name:Sodium-dependent noradrenaline transporter
Type:Multi-pass membrane protein
Mol. Mass.:69337.72
Organism:Homo sapiens (Human)
Description:P23975
Residue:617
BDBM50294256
NameBDBM50294256
Synonyms:2-((2,3-dichlorophenoxy)((R)-pyrrolidin-3-yl)methyl)pyridine | CHEMBL551573
TypeSmall organic molecule
Emp. Form.C16H16Cl2N2O
Mol. Mass.323.217
SMILESClc1cccc(OC([C@@H]2CCNC2)c2ccccn2)c1Cl