Reaction Details
TargetSodium-dependent dopamine transporter
LigandBDBM50294268
Substrate/Competitorn/a
Meas. Tech.ChEMBL_575207 (CHEMBL1024554)
IC50 7830±n/a nM
Citation Fish, PVAndrews, MDJonathan Fray, MStobie, AWakenhut, FWhitlock, GA 4-Piperidines and 3-pyrrolidines as dual serotonin and noradrenaline reuptake inhibitors: design, synthesis and structure-activity relationships. Bioorg Med Chem Lett19:2829-34 (2009) 
 
Sodium-dependent dopamine transporter
Name:Sodium-dependent dopamine transporter
Type:Multi-pass membrane protein
Mol. Mass.:68497.11
Organism:Homo sapiens (Human)
Description:Q01959
Residue:620
BDBM50294268
NameBDBM50294268
Synonyms:CHEMBL562444 | rac-3-((4-ethylphenoxy)(piperidin-4-yl)methyl)pyridine
TypeSmall organic molecule
Emp. Form.C19H24N2O
Mol. Mass.296.4067
SMILESCCc1ccc(OC(C2CCNCC2)c2cccnc2)cc1