Reaction Details
TargetSodium-dependent dopamine transporter
LigandBDBM50294286
Substrate/Competitorn/a
Meas. Tech.ChEMBL_575207 (CHEMBL1024554)
IC50 6±n/a nM
Citation Fish, PVAndrews, MDJonathan Fray, MStobie, AWakenhut, FWhitlock, GA 4-Piperidines and 3-pyrrolidines as dual serotonin and noradrenaline reuptake inhibitors: design, synthesis and structure-activity relationships. Bioorg Med Chem Lett19:2829-34 (2009) 
 
Sodium-dependent dopamine transporter
Name:Sodium-dependent dopamine transporter
Type:Multi-pass membrane protein
Mol. Mass.:68497.11
Organism:Homo sapiens (Human)
Description:Q01959
Residue:620
BDBM50294286
NameBDBM50294286
Synonyms:3-((2,3-dichlorophenoxy)((R)-piperidin-3-yl)methyl)pyridine | CHEMBL549825
TypeSmall organic molecule
Emp. Form.C17H18Cl2N2O
Mol. Mass.337.244
SMILESClc1cccc(OC([C@@H]2CCCNC2)c2cccnc2)c1Cl