Reaction Details
TargetSodium-dependent dopamine transporter
LigandBDBM50136134
Substrate/Competitorn/a
Meas. Tech.ChEMBL_575207 (CHEMBL1024554)
IC50 370±n/a nM
Citation Fish, PVAndrews, MDJonathan Fray, MStobie, AWakenhut, FWhitlock, GA 4-Piperidines and 3-pyrrolidines as dual serotonin and noradrenaline reuptake inhibitors: design, synthesis and structure-activity relationships. Bioorg Med Chem Lett19:2829-34 (2009) 
 
Sodium-dependent dopamine transporter
Name:Sodium-dependent dopamine transporter
Type:Multi-pass membrane protein
Mol. Mass.:68497.11
Organism:Homo sapiens (Human)
Description:Q01959
Residue:620
BDBM50136134
NameBDBM50136134
Synonyms:4-[(Naphthalen-1-yloxy)-phenyl-methyl]-piperidine rac-4-((naphthalen-1-yloxy)(phenyl)methyl)piperidine
TypeSmall organic molecule
Emp. Form.C22H23NO
Mol. Mass.317.4241
SMILESC1CC(CCN1)C(Oc1cccc2ccccc12)c1ccccc1