Reaction Details
TargetPotassium voltage-gated channel subfamily H member 2
LigandBDBM50294257
Substrate/Competitorn/a
Meas. Tech.ChEMBL_575209 (CHEMBL1024556)
IC50>10000±n/a nM
Citation Fish, PVAndrews, MDJonathan Fray, MStobie, AWakenhut, FWhitlock, GA 4-Piperidines and 3-pyrrolidines as dual serotonin and noradrenaline reuptake inhibitors: design, synthesis and structure-activity relationships. Bioorg Med Chem Lett19:2829-34 (2009) 
 
Potassium voltage-gated channel subfamily H member 2
Name:Potassium voltage-gated channel subfamily H member 2
Type:Multi-pass membrane protein
Mol. Mass.:126672.65
Organism:Homo sapiens (Human)
Description:Q12809
Residue:1159
BDBM50294257
NameBDBM50294257
Synonyms:2-((2,3-dichlorophenoxy)((S)-pyrrolidin-3-yl)methyl)pyridine | CHEMBL563495
TypeSmall organic molecule
Emp. Form.C16H16Cl2N2O
Mol. Mass.323.217
SMILESClc1cccc(OC([C@H]2CCNC2)c2ccccn2)c1Cl