Reaction Details
TargetCytochrome P450 2D6
LigandBDBM84745
Substrate/Competitorn/a
Meas. Tech.ChEMBL_575311 (CHEMBL1023618)
IC50 1000±n/a nM
Citation Fish, PVAndrews, MDJonathan Fray, MStobie, AWakenhut, FWhitlock, GA 4-Piperidines and 3-pyrrolidines as dual serotonin and noradrenaline reuptake inhibitors: design, synthesis and structure-activity relationships. Bioorg Med Chem Lett19:2829-34 (2009) 
 
Cytochrome P450 2D6
Name:Cytochrome P450 2D6
Type:Protein
Mol. Mass.:55774.82
Organism:Homo sapiens (Human)
Description:P10635
Residue:497
BDBM84745
NameBDBM84745
Synonyms:CAS_136434-34-9 LY-248686 USRE49340, Rank 5
TypeSmall organic molecule
Emp. Form.C18H19NOS
Mol. Mass.297.415
SMILESCNCC[C@H](Oc1cccc2ccccc12)c1cccs1