Reaction Details
TargetCytochrome P450 2D6
LigandBDBM50294271
Substrate/Competitorn/a
Meas. Tech.ChEMBL_575311 (CHEMBL1023618)
IC50 30000±n/a nM
Citation Fish, PVAndrews, MDJonathan Fray, MStobie, AWakenhut, FWhitlock, GA 4-Piperidines and 3-pyrrolidines as dual serotonin and noradrenaline reuptake inhibitors: design, synthesis and structure-activity relationships. Bioorg Med Chem Lett19:2829-34 (2009) 
 
Cytochrome P450 2D6
Name:Cytochrome P450 2D6
Type:Protein
Mol. Mass.:55774.82
Organism:Homo sapiens (Human)
Description:P10635
Residue:497
BDBM50294271
NameBDBM50294271
Synonyms:5-((2,3-dichlorophenoxy)(piperidin-4-yl)methyl)-2-methyl pyridine CHEMBL559081 | rac-3-((2,3-dichloro-6-methylphenoxy)(piperidin-4-yl)methyl)pyridine
TypeSmall organic molecule
Emp. Form.C18H20Cl2N2O
Mol. Mass.351.27
SMILESCc1ccc(cn1)C(Oc1cccc(Cl)c1Cl)C1CCNCC1