Reaction Details
TargetCytochrome P450 2D6
LigandBDBM50294286
Substrate/Competitorn/a
Meas. Tech.ChEMBL_575311 (CHEMBL1023618)
IC50 2400±n/a nM
Citation Fish, PVAndrews, MDJonathan Fray, MStobie, AWakenhut, FWhitlock, GA 4-Piperidines and 3-pyrrolidines as dual serotonin and noradrenaline reuptake inhibitors: design, synthesis and structure-activity relationships. Bioorg Med Chem Lett19:2829-34 (2009) 
 
Cytochrome P450 2D6
Name:Cytochrome P450 2D6
Type:Protein
Mol. Mass.:55774.82
Organism:Homo sapiens (Human)
Description:P10635
Residue:497
BDBM50294286
NameBDBM50294286
Synonyms:3-((2,3-dichlorophenoxy)((R)-piperidin-3-yl)methyl)pyridine | CHEMBL549825
TypeSmall organic molecule
Emp. Form.C17H18Cl2N2O
Mol. Mass.337.244
SMILESClc1cccc(OC([C@@H]2CCCNC2)c2cccnc2)c1Cl