Reaction Details
TargetCytochrome P450 2D6
LigandBDBM50294257
Substrate/Competitorn/a
Meas. Tech.ChEMBL_575311 (CHEMBL1023618)
IC50 5300±n/a nM
Citation Fish, PVAndrews, MDJonathan Fray, MStobie, AWakenhut, FWhitlock, GA 4-Piperidines and 3-pyrrolidines as dual serotonin and noradrenaline reuptake inhibitors: design, synthesis and structure-activity relationships. Bioorg Med Chem Lett19:2829-34 (2009) 
 
Cytochrome P450 2D6
Name:Cytochrome P450 2D6
Type:Protein
Mol. Mass.:55774.82
Organism:Homo sapiens (Human)
Description:P10635
Residue:497
BDBM50294257
NameBDBM50294257
Synonyms:2-((2,3-dichlorophenoxy)((S)-pyrrolidin-3-yl)methyl)pyridine | CHEMBL563495
TypeSmall organic molecule
Emp. Form.C16H16Cl2N2O
Mol. Mass.323.217
SMILESClc1cccc(OC([C@H]2CCNC2)c2ccccn2)c1Cl