Reaction Details
TargetChitinase B
LigandBDBM50294763
Substrate/Competitorn/a
Meas. Tech.ChEMBL_576284 (CHEMBL1030286)
IC50 230±n/a nM
Citation Gouda, HSunazuka, TIguchi, KSugawara, AHirose, TNoguchi, YSaito, YYanai, YYamamoto, TWatanabe, TShiomi, KOmura, SHirono, S Computer-aided rational molecular design of argifin-derivatives with increased inhibitory activity against chitinase B from Serratia marcescens. Bioorg Med Chem Lett19:2630-3 (2009) 
 
Chitinase B
Name:Chitinase B
Type:Enzyme
Mol. Mass.:55462.70
Organism:Serratia marcescens
Description:P11797
Residue:499
BDBM50294763
NameBDBM50294763
Synonyms:(2R,5S,8S,11S,15S)-8-benzyl-15-(4-benzylpiperidine-1-carbonyl)-5-(3-(iminio(3-methylureido)methylamino)propyl)-2-isobutyl-7-methyl-3,6,9,13,17-pentaoxo-1,4,7,10,14-pentaazacycloheptadecane-11-carboxylate | CHEMBL555042
TypeSmall organic molecule
Emp. Form.C44H62N10O9
Mol. Mass.875.0247
SMILESCNC(=O)NC(N)=NCCC[C@@H]1NC(=O)[C@@H](CC(C)C)NC(=O)C[C@H](NC(=O)C[C@H](NC(=O)[C@H](Cc2ccccc2)N(C)C1=O)C(O)=O)C(=O)N1CCC(Cc2ccccc2)CC1