Reaction Details
Target11-beta-hydroxysteroid dehydrogenase 1
LigandBDBM50294781
Substrate/Competitorn/a
Meas. Tech.ChEMBL_576303 (CHEMBL1030305)
IC50 8±n/a nM
Citation Roche, DCarniato, DLeriche, CLepifre, FChristmann-Franck, SGraedler, UCharon, CBozec, SDoare, LSchmidlin, FLecomte, MValeur, E Discovery and structure-activity relationships of pentanedioic acid diamides as potent inhibitors of 11beta-hydroxysteroid dehydrogenase type I. Bioorg Med Chem Lett19:2674-8 (2009) 
 
11-beta-hydroxysteroid dehydrogenase 1
Name:11-beta-hydroxysteroid dehydrogenase 1
Type:Enzyme
Mol. Mass.:32409.16
Organism:Homo sapiens (Human)
Description:P28845
Residue:292
BDBM50294781
NameBDBM50294781
Synonyms:CHEMBL552159 | N-Adamantan-2-yl-4-(3-isopropyl-[1,2,4]oxadiazol-5-yl)-3,3-dimethyl-butyramide
TypeSmall organic molecule
Emp. Form.C21H33N3O2
Mol. Mass.359.5056
SMILESCC(C)c1noc(CC(C)(C)CC(=O)NC2C3CC4CC(C3)CC2C4)n1