Reaction Details
Target11-beta-hydroxysteroid dehydrogenase 1
LigandBDBM50294783
Substrate/Competitorn/a
Meas. Tech.ChEMBL_576303 (CHEMBL1030305)
IC50 8±n/a nM
Citation Roche, DCarniato, DLeriche, CLepifre, FChristmann-Franck, SGraedler, UCharon, CBozec, SDoare, LSchmidlin, FLecomte, MValeur, E Discovery and structure-activity relationships of pentanedioic acid diamides as potent inhibitors of 11beta-hydroxysteroid dehydrogenase type I. Bioorg Med Chem Lett19:2674-8 (2009) 
 
11-beta-hydroxysteroid dehydrogenase 1
Name:11-beta-hydroxysteroid dehydrogenase 1
Type:Enzyme
Mol. Mass.:32409.16
Organism:Homo sapiens (Human)
Description:P28845
Residue:292
BDBM50294783
NameBDBM50294783
Synonyms:3,3-Dimethyl-pentanedioic acid(5-carbamoyl-adamantan-2-yl)-amide cyclopropylamide | CHEMBL563234
TypeSmall organic molecule
Emp. Form.C21H33N3O3
Mol. Mass.375.505
SMILESCC(C)(CC(=O)NC1CC1)CC(=O)N[C@H]1C2CC3CC1C[C@](C3)(C2)C(N)=O