Reaction Details
TargetD(3) dopamine receptor
LigandBDBM50294844
Substrate/Competitorn/a
Meas. Tech.ChEMBL_576760 (CHEMBL1032027)
Ki 0.55±n/a nM
Citation Brown, DAMishra, MZhang, SBiswas, SParrington, IAntonio, TReith, MEDutta, AK Investigation of various N-heterocyclic substituted piperazine versions of 5/7-{[2-(4-aryl-piperazin-1-yl)-ethyl]-propyl-amino}-5,6,7,8-tetrahydro-naphthalen-2-ol: effect on affinity and selectivity for dopamine D3 receptor. Bioorg Med Chem17:3923-33 (2009) 
 
D(3) dopamine receptor
Name:D(3) dopamine receptor
Type:Protein
Mol. Mass.:49540.58
Organism:Rattus norvegicus (Rat)
Description:P19020
Residue:446
BDBM50294844
NameBDBM50294844
Synonyms:(+)-(4-{2-[(5-Hydroxy-1,2,3,4-tetrahydro-naphthalen-2-yl)-propyl-amino]-ethyl}-piperazin-1-yl)-(1H-indol-2-yl)-methanone (-)-(4-{2-[(5-Hydroxy-1,2,3,4-tetrahydro-naphthalen-2-yl)-propyl-amino]-ethyl}-piperazin-1-yl)-(1H-indol-2-yl)-methanone | CHEMBL551960
TypeSmall organic molecule
Emp. Form.C28H36N4O2
Mol. Mass.460.611
SMILESCCCN(CCN1CCN(CC1)C(=O)c1cc2ccccc2[nH]1)C1CCc2c(O)cccc2C1