Reaction Details
TargetPoly [ADP-ribose] polymerase 1
LigandBDBM50295211
Substrate/Competitorn/a
Meas. Tech.ChEMBL_577412 (CHEMBL1056264)
IC50 100±n/a nM
Citation Orvieto, FBranca, DGiomini, CJones, PKoch, UOntoria, JMPalumbi, MCRowley, MToniatti, CMuraglia, E Identification of substituted pyrazolo[1,5-a]quinazolin-5(4H)-one as potent poly(ADP-ribose)polymerase-1 (PARP-1) inhibitors. Bioorg Med Chem Lett19:4196-200 (2009) 
 
Poly [ADP-ribose] polymerase 1
Name:Poly [ADP-ribose] polymerase 1
Type:n/a
Mol. Mass.:113114.22
Organism:Homo sapiens (Human)
Description:P09874
Residue:1014
BDBM50295211
NameBDBM50295211
Synonyms:2-phenylpyrazolo[1,5-a]quinazolin-5(4H)-one | CHEMBL571223
TypeSmall organic molecule
Emp. Form.C16H11N3O
Mol. Mass.261.278
SMILESO=c1[nH]c2cc(nn2c2ccccc12)-c1ccccc1