Reaction Details
TargetPoly [ADP-ribose] polymerase 1
LigandBDBM50295212
Substrate/Competitorn/a
Meas. Tech.ChEMBL_577412 (CHEMBL1056264)
IC50 100±n/a nM
Citation Orvieto, FBranca, DGiomini, CJones, PKoch, UOntoria, JMPalumbi, MCRowley, MToniatti, CMuraglia, E Identification of substituted pyrazolo[1,5-a]quinazolin-5(4H)-one as potent poly(ADP-ribose)polymerase-1 (PARP-1) inhibitors. Bioorg Med Chem Lett19:4196-200 (2009) 
 
Poly [ADP-ribose] polymerase 1
Name:Poly [ADP-ribose] polymerase 1
Type:n/a
Mol. Mass.:113114.22
Organism:Homo sapiens (Human)
Description:P09874
Residue:1014
BDBM50295212
NameBDBM50295212
Synonyms:2-(2,3-dimethoxyphenyl)pyrazolo[1,5-a]quinazolin-5(4H)-one | CHEMBL551916
TypeSmall organic molecule
Emp. Form.C18H15N3O3
Mol. Mass.321.33
SMILESCOc1cccc(-c2cc3[nH]c(=O)c4ccccc4n3n2)c1OC