Reaction Details
TargetNeuraminidase
LigandBDBM50295348
Substrate/Competitorn/a
Meas. Tech.ChEMBL_578382 (CHEMBL1057938)
IC50 7000000±n/a nM
Citation Sakamoto, JKoyama, TMiyamoto, DYingsakmongkon, SHidari, KIJampangern, WSuzuki, TSuzuki, YEsumi, YNakamura, THatano, KTerunuma, DMatsuoka, K Systematic syntheses of influenza neuraminidase inhibitors: a series of carbosilane dendrimers uniformly functionalized with thioglycoside-type sialic acid moieties. Bioorg Med Chem17:5451-64 (2009) 
 
Neuraminidase
Name:Neuraminidase
Type:PROTEIN
Mol. Mass.:52105.18
Organism:Influenza A virus (strain A/Memphis/1/1971 H3N2)
Description:ChEMBL_578382
Residue:469
BDBM50295348
NameBDBM50295348
Synonyms:(R,R,2S,2'S,4S,4'S,5R,5'R,6R,6'R)-2,2'-(10,10,18,18-tetrakis(3-(5-((2S,4S,5R,6R)-5-acetamido-2-carboxy-4-hydroxy-6-((1R,2R)-1,2,3-trihydroxypropyl)tetrahydro-2H-pyran-2-ylthio)pentylthio)propyl)-14,14-bis(3-(tris(3-(5-((2S,4S,5R,6R)-5-acetamido-2-carboxy-4-hydroxy-6-((1R,2R)-1,2,3-trihydroxypropyl)tetrahydro-2H-pyran-2-ylthio)pentylthio)propyl)silyl)propyl)-6,22-dithia-10,14,18-trisilaheptacosane-1,27-diyl)bis(sulfanediyl)bis(5-acetamido-4-hydroxy-6-((1R,2R)-1,2,3-trihydroxypropyl)tetrahydr | CHEMBL558359
TypeSmall organic molecule
Emp. Form.C240H432N12O96S24Si5
Mol. Mass.5932.008
SMILESCC(=O)N[C@@H]1[C@@H](O)C[C@](O[C@H]1[C@H](O)[C@H](O)CO)(SCCCCCSCCC[Si](CCCSCCCCCS[C@@]1(C[C@H](O)[C@@H](NC(C)=O)[C@@H](O1)[C@H](O)[C@H](O)CO)C(O)=O)(CCCSCCCCCS[C@@]1(C[C@H](O)[C@@H](NC(C)=O)[C@@H](O1)[C@H](O)[C@H](O)CO)C(O)=O)CCC[Si](CCC[Si](CCCSCCCCCS[C@@]1(C[C@H](O)[C@@H](NC(C)=O)[C@@H](O1)[C@H](O)[C@H](O)CO)C(O)=O)(CCCSCCCCCS[C@@]1(C[C@H](O)[C@@H](NC(C)=O)[C@@H](O1)[C@H](O)[C@H](O)CO)C(O)=O)CCCSCCCCCS[C@@]1(C[C@H](O)[C@@H](NC(C)=O)[C@@H](O1)[C@H](O)[C@H](O)CO)C(O)=O)(CCC[Si](CCCSCCCCCS[C@@]1(C[C@H](O)[C@@H](NC(C)=O)[C@@H](O1)[C@H](O)[C@H](O)CO)C(O)=O)(CCCSCCCCCS[C@@]1(C[C@H](O)[C@@H](NC(C)=O)[C@@H](O1)[C@H](O)[C@H](O)CO)C(O)=O)CCCSCCCCCS[C@@]1(C[C@H](O)[C@@H](NC(C)=O)[C@@H](O1)[C@H](O)[C@H](O)CO)C(O)=O)CCC[Si](CCCSCCCCCS[C@@]1(C[C@H](O)[C@@H](NC(C)=O)[C@@H](O1)[C@H](O)[C@H](O)CO)C(O)=O)(CCCSCCCCCS[C@@]1(C[C@H](O)[C@@H](NC(C)=O)[C@@H](O1)[C@H](O)[C@H](O)CO)C(O)=O)CCCSCCCCCS[C@@]1(C[C@H](O)[C@@H](NC(C)=O)[C@@H](O1)[C@H](O)[C@H](O)CO)C(O)=O)C(O)=O