Reaction Details
TargetMultidrug resistance-associated protein 1
LigandBDBM7462
Substrate/Competitorn/a
Meas. Tech.ChEMBL_579092 (CHEMBL1062294)
Ki 2400±n/a nM
Citation Wong, ILChan, KFTsang, KHLam, CYZhao, YChan, THChow, LM Modulation of multidrug resistance protein 1 (MRP1/ABCC1)-mediated multidrug resistance by bivalent apigenin homodimers and their derivatives. J Med Chem52:5311-22 (2009) 
 
Multidrug resistance-associated protein 1
Name:Multidrug resistance-associated protein 1
Type:n/a
Mol. Mass.:171597.72
Organism:Homo sapiens (Human)
Description:P33527
Residue:1531
BDBM7462
NameBDBM7462
Synonyms:3,5,7-trihydroxy-2-(4-hydroxyphenyl)-4H-chromen-4-one CHEMBL150 Kaempferol (Kmp) kaempferol
TypeSmall organic molecule
Emp. Form.C15H10O6
Mol. Mass.286.2363
SMILESOc1ccc(cc1)-c1oc2cc(O)cc(O)c2c(=O)c1O