Reaction Details
TargetHistamine H1 receptor
LigandBDBM50295718
Substrate/Competitorn/a
Meas. Tech.ChEMBL_577960 (CHEMBL1059633)
IC50 28±n/a nM
Citation Kubota, KKurebayashi, HMiyachi, HTobe, MOnishi, MIsobe, Y Synthesis and structure-activity relationships of phenothiazine carboxylic acids having pyrimidine-dione as novel histamine H(1) antagonists. Bioorg Med Chem Lett19:2766-71 (2009) 
 
Histamine H1 receptor
Name:Histamine H1 receptor
Type:G Protein-Coupled Receptor (GPCR)
Mol. Mass.:55808.72
Organism:Homo sapiens (Human)
Description:Cell pellets from SK-N-MC cells transfected with human H1 receptor were used in binding assay.
Residue:487
BDBM50295718
NameBDBM50295718
Synonyms:6-(3-(4-(3,4-dichlorophenoxy)piperidin-1-yl)propylamino)-1,3-dimethylpyrimidine-2,4(1H,3H)-dione | CHEMBL560120
TypeSmall organic molecule
Emp. Form.C20H26Cl2N4O3
Mol. Mass.441.351
SMILESCn1c(NCCCN2CCC(CC2)Oc2ccc(Cl)c(Cl)c2)cc(=O)n(C)c1=O