Reaction Details
TargetOxytocin receptor
LigandBDBM50295780
Substrate/Competitorn/a
Meas. Tech.ChEMBL_578145 (CHEMBL1059543)
Ki 37.5±n/a nM
Citation Brown, AEllis, DPearce, DRalph, MSciammetta, N Aryloxypyrazines as highly selective antagonists of Oxytocin. Bioorg Med Chem Lett19:2634-6 (2009) 
 
Oxytocin receptor
Name:Oxytocin receptor
Type:Enzyme Catalytic Domain
Mol. Mass.:42793.26
Organism:Homo sapiens (Human)
Description:Oxytocin OXTR HEK293::B2R9L7
Residue:389
BDBM50295780
NameBDBM50295780
Synonyms:2-(2,4-dichlorophenoxy)-5-(4-(6-methoxypyridin-3-yl)-5-methyl-4H-1,2,4-triazol-3-yl)pyrazine | CHEMBL563613
TypeSmall organic molecule
Emp. Form.C19H14Cl2N6O2
Mol. Mass.429.259
SMILESCOc1ccc(cn1)-n1c(C)nnc1-c1cnc(Oc2ccc(Cl)cc2Cl)cn1