Reaction Details
TargetGlycogen phosphorylase, muscle form
LigandBDBM50263771
Substrate/Competitorn/a
Meas. Tech.ChEMBL_578476 (CHEMBL1063135)
Ki 4600±n/a nM
Citation Tóth, MKun, SBokor, EBenltifa, MTallec, GVidal, SDocsa, TGergely, PSomsák, LPraly, JP Synthesis and structure-activity relationships of C-glycosylated oxadiazoles as inhibitors of glycogen phosphorylase. Bioorg Med Chem17:4773-85 (2009) 
 
Glycogen phosphorylase, muscle form
Name:Glycogen phosphorylase, muscle form
Type:Enzyme
Mol. Mass.:97296.32
Organism:Oryctolagus cuniculus (rabbit)
Description:Phosphorylation of Ser-15 converts phosphorylase B (unphosphorylated) to phosphorylase A.
Residue:843
BDBM50263771
NameBDBM50263771
Synonyms:1-benzoyl-3-((2R,3R,4S,5S,6R)-3,4,5-trihydroxy-6-(hydroxymethyl)-tetrahydro-2H-pyran-2-yl)urea N-((2R,3R,4S,5S,6R)-3,4,5-trihydroxy-6-(hydroxymethyl)tetrahydro-2H-pyran-2-ylcarbamoyl)benzamide | N-BENZOYL-N'-BETA-D-GLUCOPYRANOSYL UREA
TypeSmall organic molecule
Emp. Form.C14H18N2O7
Mol. Mass.326.3019
SMILESOC[C@H]1O[C@@H](NC(=O)NC(=O)c2ccccc2)[C@H](O)[C@@H](O)[C@@H]1O