Reaction Details
TargetD(2) dopamine receptor
LigandBDBM50295863
Substrate/Competitorn/a
Meas. Tech.ChEMBL_578483 (CHEMBL1063142)
Ki 1.5±n/a nM
Citation Herm, LBerényi, SVonk, ARinken, ASipos, A N-Substituted-2-alkyl- and 2-arylnorapomorphines: novel, highly active D2 agonists. Bioorg Med Chem17:4756-62 (2009) 
 
D(2) dopamine receptor
Name:D(2) dopamine receptor
Type:G Protein-Coupled Receptor (GPCR)
Mol. Mass.:50931.60
Organism:Rattus norvegicus (rat)
Description:P61169
Residue:444
BDBM50295863
NameBDBM50295863
Synonyms:CHEMBL562935 | N-Ethyl-2-(4-hydroxyphenyl)-norapomorphine hydrochloride
TypeSmall organic molecule
Emp. Form.C24H23NO3
Mol. Mass.373.4443
SMILESCCN1CCc2cc(cc-3c2[C@H]1Cc1ccc(O)c(O)c-31)-c1ccc(O)cc1