Reaction Details
TargetAurora kinase A
LigandBDBM50295903
Substrate/Competitorn/a
Meas. Tech.ChEMBL_578966 (CHEMBL1064037)
IC50>40000±n/a nM
Citation Ye, QXu, GLv, DCheng, ZLi, JHu, Y Synthesis and biological evaluation of novel 4-azaindolyl-indolyl-maleimides as glycogen synthase kinase-3beta (GSK-3beta) inhibitors. Bioorg Med Chem17:4302-12 (2009) 
 
Aurora kinase A
Name:Aurora kinase A
Type:Serine/threonine-protein kinase
Mol. Mass.:45830.98
Organism:Homo sapiens (Human)
Description:O14965
Residue:403
BDBM50295903
NameBDBM50295903
Synonyms:3-(5-Bromo-1-(3-(1H-imidazol-1-yl)propyl)-1H-indol-3-yl)-4-(1H-pyrrolo[3,2-b]pyridin-1-yl)-1H-pyrrole-2,5-dione | CHEMBL561066
TypeSmall organic molecule
Emp. Form.C25H19BrN6O2
Mol. Mass.515.361
SMILESBrc1ccc2n(CCCn3ccnc3)cc(C3=C(C(=O)NC3=O)n3ccc4ncccc34)c2c1