Reaction Details
TargetDual specificity mitogen-activated protein kinase kinase 1
LigandBDBM50295903
Substrate/Competitorn/a
Meas. Tech.ChEMBL_578967 (CHEMBL1064038)
IC50>40000±n/a nM
Citation Ye, QXu, GLv, DCheng, ZLi, JHu, Y Synthesis and biological evaluation of novel 4-azaindolyl-indolyl-maleimides as glycogen synthase kinase-3beta (GSK-3beta) inhibitors. Bioorg Med Chem17:4302-12 (2009) 
 
Dual specificity mitogen-activated protein kinase kinase 1
Name:Dual specificity mitogen-activated protein kinase kinase 1
Type:Other Protein Type
Mol. Mass.:43439.03
Organism:Homo sapiens (Human)
Description:Full-length human MEK-1 was generated by PCR and purified as a fusion protein from Escherichia coli lysates.
Residue:393
BDBM50295903
NameBDBM50295903
Synonyms:3-(5-Bromo-1-(3-(1H-imidazol-1-yl)propyl)-1H-indol-3-yl)-4-(1H-pyrrolo[3,2-b]pyridin-1-yl)-1H-pyrrole-2,5-dione | CHEMBL561066
TypeSmall organic molecule
Emp. Form.C25H19BrN6O2
Mol. Mass.515.361
SMILESBrc1ccc2n(CCCn3ccnc3)cc(C3=C(C(=O)NC3=O)n3ccc4ncccc34)c2c1