Reaction Details
TargetGlycogen synthase kinase-3 beta
LigandBDBM50295908
Substrate/Competitorn/a
Meas. Tech.ChEMBL_578963 (CHEMBL1064034)
IC50 1140±n/a nM
Citation Ye, QXu, GLv, DCheng, ZLi, JHu, Y Synthesis and biological evaluation of novel 4-azaindolyl-indolyl-maleimides as glycogen synthase kinase-3beta (GSK-3beta) inhibitors. Bioorg Med Chem17:4302-12 (2009) 
 
Glycogen synthase kinase-3 beta
Name:Glycogen synthase kinase-3 beta
Type:Enzyme
Mol. Mass.:46756.38
Organism:Homo sapiens (Human)
Description:P49841
Residue:420
BDBM50295908
NameBDBM50295908
Synonyms:3-(1-(3-Hydroxypropyl)-1H-indol-3-yl)-4-(1-methyl-1Hpyrrolo[3,2-b]pyridin-3-yl)-1H-pyrrole-2,5-dione | CHEMBL552470
TypeSmall organic molecule
Emp. Form.C23H20N4O3
Mol. Mass.400.4299
SMILESCn1cc(C2=C(C(=O)NC2=O)c2cn(CCCO)c3ccccc23)c2ncccc12