Reaction Details
TargetGlycogen synthase kinase-3 beta
LigandBDBM50295913
Substrate/Competitorn/a
Meas. Tech.ChEMBL_578963 (CHEMBL1064034)
IC50 13580±n/a nM
Citation Ye, QXu, GLv, DCheng, ZLi, JHu, Y Synthesis and biological evaluation of novel 4-azaindolyl-indolyl-maleimides as glycogen synthase kinase-3beta (GSK-3beta) inhibitors. Bioorg Med Chem17:4302-12 (2009) 
 
Glycogen synthase kinase-3 beta
Name:Glycogen synthase kinase-3 beta
Type:Enzyme
Mol. Mass.:46756.38
Organism:Homo sapiens (Human)
Description:P49841
Residue:420
BDBM50295913
NameBDBM50295913
Synonyms:3-(1-(3-(Dimethylamino)propyl)-1H-indol-3-yl)-4-(1Hpyrrolo[3,2-b]pyridin-1-yl)-1H-pyrrole-2,5-dione | CHEMBL559040
TypeSmall organic molecule
Emp. Form.C24H23N5O2
Mol. Mass.413.4717
SMILESCN(C)CCCn1cc(C2=C(C(=O)NC2=O)n2ccc3ncccc23)c2ccccc12