Reaction Details
TargetGlycogen synthase kinase-3 beta
LigandBDBM50295914
Substrate/Competitorn/a
Meas. Tech.ChEMBL_578963 (CHEMBL1064034)
IC50 22460±n/a nM
Citation Ye, QXu, GLv, DCheng, ZLi, JHu, Y Synthesis and biological evaluation of novel 4-azaindolyl-indolyl-maleimides as glycogen synthase kinase-3beta (GSK-3beta) inhibitors. Bioorg Med Chem17:4302-12 (2009) 
 
Glycogen synthase kinase-3 beta
Name:Glycogen synthase kinase-3 beta
Type:Enzyme
Mol. Mass.:46756.38
Organism:Homo sapiens (Human)
Description:P49841
Residue:420
BDBM50295914
NameBDBM50295914
Synonyms:3-(5-Methoxy-1-(3-(dimethylamino)propyl)-1H-indol-3-yl)-4-(1H-pyrrolo[3,2-b]pyridin-1-yl)-1H-pyrrole-2,5-dione | CHEMBL552406
TypeSmall organic molecule
Emp. Form.C25H25N5O3
Mol. Mass.443.4977
SMILESCOc1ccc2n(CCCN(C)C)cc(C3=C(C(=O)NC3=O)n3ccc4ncccc34)c2c1