Reaction Details
TargetGlycogen synthase kinase-3 beta
LigandBDBM50295915
Substrate/Competitorn/a
Meas. Tech.ChEMBL_578963 (CHEMBL1064034)
IC50 2260±n/a nM
Citation Ye, QXu, GLv, DCheng, ZLi, JHu, Y Synthesis and biological evaluation of novel 4-azaindolyl-indolyl-maleimides as glycogen synthase kinase-3beta (GSK-3beta) inhibitors. Bioorg Med Chem17:4302-12 (2009) 
 
Glycogen synthase kinase-3 beta
Name:Glycogen synthase kinase-3 beta
Type:Enzyme
Mol. Mass.:46756.38
Organism:Homo sapiens (Human)
Description:P49841
Residue:420
BDBM50295915
NameBDBM50295915
Synonyms:3-(6-Bromo-1-(3-(dimethylamino)propyl)-1H-indol-3-yl)-4-(1H-pyrrolo[3,2-b]pyridin-1-yl)-1H-pyrrole-2,5-dione | CHEMBL562814
TypeSmall organic molecule
Emp. Form.C24H22BrN5O2
Mol. Mass.492.368
SMILESCN(C)CCCn1cc(C2=C(C(=O)NC2=O)n2ccc3ncccc23)c2ccc(Br)cc12