Reaction Details
TargetProstaglandin G/H synthase 2
LigandBDBM50295925
Substrate/Competitorn/a
Meas. Tech.ChEMBL_578974 (CHEMBL1061423)
IC50 2700±n/a nM
Citation Schühly, WHüfner, APferschy-Wenzig, EMPrettner, EAdams, MBodensieck, AKunert, OOluwemimo, AHaslinger, EBauer, R Design and synthesis of ten biphenyl-neolignan derivatives and their in vitro inhibitory potency against cyclooxygenase-1/2 activity and 5-lipoxygenase-mediated LTB4-formation. Bioorg Med Chem17:4459-65 (2009) 
 
Prostaglandin G/H synthase 2
Name:Prostaglandin G/H synthase 2
Type:Protein
Mol. Mass.:68976.98
Organism:Ovis aries (Sheep)
Description:n/a
Residue:603
BDBM50295925
NameBDBM50295925
Synonyms:(E)-3'-Propenyl)-5-(2-propenyl)-biphenyl-2,4'-diol Magreth-4
TypeSmall organic molecule
Emp. Form.C18H18O2
Mol. Mass.266.3343
SMILESC\C=C\c1cc(ccc1O)-c1cc(CC=C)ccc1O