Reaction Details
TargetHistamine H3 receptor
LigandBDBM50296179
Substrate/Competitorn/a
Meas. Tech.ChEMBL_579538 (CHEMBL1061547)
IC50 0.16±n/a nM
Citation Sasaki, TTakahashi, TNagase, TMizutani, TIto, SMitobe, YMiyamoto, YKanesaka, MYoshimoto, RTanaka, TTakenaga, NTokita, SSato, N Synthesis, structure-activity relationships, and biological profiles of a dihydrobenzoxathiin class of histamine H(3) receptor inverse agonists. Bioorg Med Chem Lett19:4232-6 (2009) 
 
Histamine H3 receptor
Name:Histamine H3 receptor
Type:G Protein-Coupled Receptor (GPCR)
Mol. Mass.:48691.47
Organism:Homo sapiens (Human)
Description:Binding assays were using CHO cells stably expressing hH3R receptors.
Residue:445
BDBM50296179
NameBDBM50296179
Synonyms:(+/-)-1-Cyclobutyl-4-[4-(8-methoxy-3-methyl-4,4-dioxo-3,4-dihydro-2H-4lambda*6*-benzo[1,4]oxathiin-2-yl)-phenoxy]-piperidine | CHEMBL562870
TypeSmall organic molecule
Emp. Form.C25H31NO5S
Mol. Mass.457.582
SMILESCOc1cccc2c1OC(C(C)S2(=O)=O)c1ccc(OC2CCN(CC2)C2CCC2)cc1