Reaction Details
TargetPotassium voltage-gated channel subfamily H member 2
LigandBDBM50296181
Substrate/Competitorn/a
Meas. Tech.ChEMBL_579539 (CHEMBL1061548)
IC50 1300±n/a nM
Citation Sasaki, TTakahashi, TNagase, TMizutani, TIto, SMitobe, YMiyamoto, YKanesaka, MYoshimoto, RTanaka, TTakenaga, NTokita, SSato, N Synthesis, structure-activity relationships, and biological profiles of a dihydrobenzoxathiin class of histamine H(3) receptor inverse agonists. Bioorg Med Chem Lett19:4232-6 (2009) 
 
Potassium voltage-gated channel subfamily H member 2
Name:Potassium voltage-gated channel subfamily H member 2
Type:Multi-pass membrane protein
Mol. Mass.:126672.65
Organism:Homo sapiens (Human)
Description:Q12809
Residue:1159
BDBM50296181
NameBDBM50296181
Synonyms:(+/-)-1-{3-[4-(3-Methyl-4,4-dioxo-3,4-dihydro-2H-4lambda*6*-benzo[1,4]oxathiin-2-yl)-phenoxy]-propyl}-pyrrolidine | CHEMBL562326
TypeSmall organic molecule
Emp. Form.C22H27NO4S
Mol. Mass.401.519
SMILESCC1C(Oc2ccccc2S1(=O)=O)c1ccc(OCCCN2CCCC2)cc1