Reaction Details
TargetHistamine H3 receptor
LigandBDBM50296185
Substrate/Competitorn/a
Meas. Tech.ChEMBL_579538 (CHEMBL1061547)
IC50 1.8±n/a nM
Citation Sasaki, TTakahashi, TNagase, TMizutani, TIto, SMitobe, YMiyamoto, YKanesaka, MYoshimoto, RTanaka, TTakenaga, NTokita, SSato, N Synthesis, structure-activity relationships, and biological profiles of a dihydrobenzoxathiin class of histamine H(3) receptor inverse agonists. Bioorg Med Chem Lett19:4232-6 (2009) 
 
Histamine H3 receptor
Name:Histamine H3 receptor
Type:G Protein-Coupled Receptor (GPCR)
Mol. Mass.:48691.47
Organism:Homo sapiens (Human)
Description:Binding assays were using CHO cells stably expressing hH3R receptors.
Residue:445
BDBM50296185
NameBDBM50296185
Synonyms:CHEMBL550393 | trans-1-(3-(4-(3-methyl-2,3-dihydrobenzo[b][1,4]oxathiin-2-yl)phenoxy)propyl)pyrrolidine
TypeSmall organic molecule
Emp. Form.C22H27NO2S
Mol. Mass.369.52
SMILESC[C@H]1Sc2ccccc2O[C@@H]1c1ccc(OCCCN2CCCC2)cc1