Reaction Details
TargetcGMP-specific 3',5'-cyclic phosphodiesterase
LigandBDBM50296255
Substrate/Competitorn/a
Meas. Tech.ChEMBL_579817 (CHEMBL1059718)
IC50 1.2±n/a nM
Citation Hughes, ROWalker, JKCubbage, JWFobian, YMRogier, DJHeasley, SEBlevis-Bal, RMBenson, AGOwen, DRJacobsen, EJFreskos, JNMolyneaux, JMBrown, DLStallings, WCAcker, BAMaddux, TMTollefson, MBWilliams, JMMoon, JBMischke, BVRumsey, JMZheng, YMacinnes, ABond, BRYu, Y Investigation of aminopyridiopyrazinones as PDE5 inhibitors: Evaluation of modifications to the central ring system. Bioorg Med Chem Lett19:4092-6 (2009) 
 
cGMP-specific 3',5'-cyclic phosphodiesterase
Name:cGMP-specific 3',5'-cyclic phosphodiesterase
Type:Protein
Mol. Mass.:99975.83
Organism:Homo sapiens (Human)
Description:O76074
Residue:875
BDBM50296255
NameBDBM50296255
Synonyms:7-(6-methoxypyridin-3-yl)-3-(2-morpholinoethylamino)-1-(2-propoxyethyl)pyrazino[2,3-b]pyrazin-2(1H)-one | CHEMBL551050
TypeSmall organic molecule
Emp. Form.C23H31N7O4
Mol. Mass.469.5367
SMILESCCCOCCn1c2nc(cnc2nc(NCCN2CCOCC2)c1=O)-c1ccc(OC)nc1