Reaction Details
TargetcGMP-specific 3',5'-cyclic phosphodiesterase
LigandBDBM50296256
Substrate/Competitorn/a
Meas. Tech.ChEMBL_579817 (CHEMBL1059718)
IC50 0.070000±n/a nM
Citation Hughes, ROWalker, JKCubbage, JWFobian, YMRogier, DJHeasley, SEBlevis-Bal, RMBenson, AGOwen, DRJacobsen, EJFreskos, JNMolyneaux, JMBrown, DLStallings, WCAcker, BAMaddux, TMTollefson, MBWilliams, JMMoon, JBMischke, BVRumsey, JMZheng, YMacinnes, ABond, BRYu, Y Investigation of aminopyridiopyrazinones as PDE5 inhibitors: Evaluation of modifications to the central ring system. Bioorg Med Chem Lett19:4092-6 (2009) 
 
cGMP-specific 3',5'-cyclic phosphodiesterase
Name:cGMP-specific 3',5'-cyclic phosphodiesterase
Type:Protein
Mol. Mass.:99975.83
Organism:Homo sapiens (Human)
Description:O76074
Residue:875
BDBM50296256
NameBDBM50296256
Synonyms:7-(6-methoxypyridin-3-yl)-3-(2-morpholinoethylamino)-1-(2-propoxyethyl)pyrido[3,4-b]pyrazin-2(1H)-one | CHEMBL551052
TypeSmall organic molecule
Emp. Form.C24H32N6O4
Mol. Mass.468.5487
SMILESCCCOCCn1c2cc(ncc2nc(NCCN2CCOCC2)c1=O)-c1ccc(OC)nc1