Reaction Details
TargetStearoyl-CoA desaturase
LigandBDBM50296305
Substrate/Competitorn/a
Meas. Tech.ChEMBL_577394 (CHEMBL1056246)
IC50 0.6±n/a nM
Citation Uto, YOgata, TKiyotsuka, YMiyazawa, YUeno, YKurata, HDeguchi, TYamada, MWatanabe, NTakagi, TWakimoto, SOkuyama, RKonishi, MKurikawa, NKono, KOsumi, J Novel and potent inhibitors of stearoyl-CoA desaturase-1. Part II: Identification of 4-ethylamino-3-(2-hydroxyethoxy)-N-[5-(3-trifluoromethylbenzyl)thiazol-2-yl]benzamide and its biological evaluation. Bioorg Med Chem Lett19:4159-66 (2009) 
 
Stearoyl-CoA desaturase
Name:Stearoyl-CoA desaturase
Type:Enzyme
Mol. Mass.:41537.27
Organism:Homo sapiens (Human)
Description:O00767
Residue:359
BDBM50296305
NameBDBM50296305
Synonyms:3-(2-hydroxyethoxy)-4-(2-methoxyethoxy)-N-(5-(3-(trifluoromethyl)benzyl)thiazol-2-yl)benzamide | CHEMBL549625
TypeSmall organic molecule
Emp. Form.C23H23F3N2O5S
Mol. Mass.496.499
SMILESCOCCOc1ccc(cc1OCCO)C(=O)Nc1ncc(Cc2cccc(c2)C(F)(F)F)s1