Reaction Details
TargetTyrosine-protein phosphatase non-receptor type 1
LigandBDBM50296389
Substrate/Competitorn/a
Meas. Tech.ChEMBL_580552 (CHEMBL1053998)
IC50 304±n/a nM
Citation Lakshminarayana, NRajendra Prasad, YGharat, LThomas, ARavikumar, PNarayanan, SSrinivasan, CVGopalan, B Synthesis and evaluation of some novel isochroman carboxylic acid derivatives as potential anti-diabetic agents. Eur J Med Chem44:3147-57 (2009) 
 
Tyrosine-protein phosphatase non-receptor type 1
Name:Tyrosine-protein phosphatase non-receptor type 1
Type:Protein phosphatase
Mol. Mass.:49963.76
Organism:Homo sapiens (Human)
Description:Human recombinant GST-fusion PTP1B (1-435).
Residue:435
BDBM50296389
NameBDBM50296389
Synonyms:(3S)-7-{4-[(3R)-1,2-Dithiolan-3-yl]butylcarboxamido}-1-oxo-isochroman-3-carboxylic acid | CHEMBL557655
TypeSmall organic molecule
Emp. Form.C18H21NO5S2
Mol. Mass.395.493
SMILESOC(=O)[C@@H]1Cc2ccc(NC(=O)CCCC[C@@H]3CCSS3)cc2C(=O)O1