Reaction Details
TargetTyrosine-protein phosphatase non-receptor type 2
LigandBDBM50296389
Substrate/Competitorn/a
Meas. Tech.ChEMBL_580553 (CHEMBL1053999)
IC50 6207±n/a nM
Citation Lakshminarayana, NRajendra Prasad, YGharat, LThomas, ARavikumar, PNarayanan, SSrinivasan, CVGopalan, B Synthesis and evaluation of some novel isochroman carboxylic acid derivatives as potential anti-diabetic agents. Eur J Med Chem44:3147-57 (2009) 
 
Tyrosine-protein phosphatase non-receptor type 2
Name:Tyrosine-protein phosphatase non-receptor type 2
Type:Protein
Mol. Mass.:48481.80
Organism:Homo sapiens (Human)
Description:P17706
Residue:415
BDBM50296389
NameBDBM50296389
Synonyms:(3S)-7-{4-[(3R)-1,2-Dithiolan-3-yl]butylcarboxamido}-1-oxo-isochroman-3-carboxylic acid | CHEMBL557655
TypeSmall organic molecule
Emp. Form.C18H21NO5S2
Mol. Mass.395.493
SMILESOC(=O)[C@@H]1Cc2ccc(NC(=O)CCCC[C@@H]3CCSS3)cc2C(=O)O1