Reaction Details
TargetReceptor-type tyrosine-protein phosphatase F
LigandBDBM50296369
Substrate/Competitorn/a
Meas. Tech.ChEMBL_580554 (CHEMBL1054000)
IC50 7034±n/a nM
Citation Lakshminarayana, NRajendra Prasad, YGharat, LThomas, ARavikumar, PNarayanan, SSrinivasan, CVGopalan, B Synthesis and evaluation of some novel isochroman carboxylic acid derivatives as potential anti-diabetic agents. Eur J Med Chem44:3147-57 (2009) 
 
Receptor-type tyrosine-protein phosphatase F
Name:Receptor-type tyrosine-protein phosphatase F
Type:Protein
Mol. Mass.:212869.85
Organism:Homo sapiens (Human)
Description:P10586
Residue:1907
BDBM50296369
NameBDBM50296369
Synonyms:(3S)-6-[4-(2-Thienyl)-butylcarboxamido]-isochroman-3-carboxylic acid | CHEMBL559312
TypeSmall organic molecule
Emp. Form.C19H21NO4S
Mol. Mass.359.439
SMILESOC(=O)[C@@H]1Cc2cc(NC(=O)CCCCc3cccs3)ccc2CO1