Reaction Details
TargetReceptor-type tyrosine-protein phosphatase F
LigandBDBM50296374
Substrate/Competitorn/a
Meas. Tech.ChEMBL_580554 (CHEMBL1054000)
IC50 458.3±n/a nM
Citation Lakshminarayana, NRajendra Prasad, YGharat, LThomas, ARavikumar, PNarayanan, SSrinivasan, CVGopalan, B Synthesis and evaluation of some novel isochroman carboxylic acid derivatives as potential anti-diabetic agents. Eur J Med Chem44:3147-57 (2009) 
 
Receptor-type tyrosine-protein phosphatase F
Name:Receptor-type tyrosine-protein phosphatase F
Type:Protein
Mol. Mass.:212869.85
Organism:Homo sapiens (Human)
Description:P10586
Residue:1907
BDBM50296374
NameBDBM50296374
Synonyms:(3S)-7-[2-(2,2-Dimethyl-1,3-dithiolan-4-yl)ethylcarboxamido]-isochroman-3-carboxylic acid | CHEMBL549372
TypeSmall organic molecule
Emp. Form.C18H23NO4S2
Mol. Mass.381.51
SMILESCC1(C)SCC(CCC(=O)Nc2ccc3C[C@H](OCc3c2)C(O)=O)S1