Reaction Details
TargetReceptor-type tyrosine-protein phosphatase F
LigandBDBM50296379
Substrate/Competitorn/a
Meas. Tech.ChEMBL_580554 (CHEMBL1054000)
IC50 2846±n/a nM
Citation Lakshminarayana, NRajendra Prasad, YGharat, LThomas, ARavikumar, PNarayanan, SSrinivasan, CVGopalan, B Synthesis and evaluation of some novel isochroman carboxylic acid derivatives as potential anti-diabetic agents. Eur J Med Chem44:3147-57 (2009) 
 
Receptor-type tyrosine-protein phosphatase F
Name:Receptor-type tyrosine-protein phosphatase F
Type:Protein
Mol. Mass.:212869.85
Organism:Homo sapiens (Human)
Description:P10586
Residue:1907
BDBM50296379
NameBDBM50296379
Synonyms:(3S)-6-[4-(1,2-Dithiolan-3-yl)butylcarboxamido]-isochroman-3-carboxylic acid | CHEMBL557393
TypeSmall organic molecule
Emp. Form.C18H23NO4S2
Mol. Mass.381.51
SMILESOC(=O)[C@@H]1Cc2cc(NC(=O)CCCCC3CCSS3)ccc2CO1