Reaction Details
TargetReceptor-type tyrosine-protein phosphatase F
LigandBDBM50296390
Substrate/Competitorn/a
Meas. Tech.ChEMBL_580554 (CHEMBL1054000)
IC50 4658±n/a nM
Citation Lakshminarayana, NRajendra Prasad, YGharat, LThomas, ARavikumar, PNarayanan, SSrinivasan, CVGopalan, B Synthesis and evaluation of some novel isochroman carboxylic acid derivatives as potential anti-diabetic agents. Eur J Med Chem44:3147-57 (2009) 
 
Receptor-type tyrosine-protein phosphatase F
Name:Receptor-type tyrosine-protein phosphatase F
Type:Protein
Mol. Mass.:212869.85
Organism:Homo sapiens (Human)
Description:P10586
Residue:1907
BDBM50296390
NameBDBM50296390
Synonyms:(2S)-3-(4-{4-[(3R)-1,2-Dithiolan-3-yl]butylcarboxamido}phenyl)-2-methoxypropanoic acid | CHEMBL562135
TypeSmall organic molecule
Emp. Form.C18H25NO4S2
Mol. Mass.383.525
SMILESCO[C@@H](Cc1ccc(NC(=O)CCCC[C@@H]2CCSS2)cc1)C(O)=O