Reaction Details
TargetNociceptin receptor
LigandBDBM50296587
Substrate/Competitorn/a
Meas. Tech.ChEMBL_582239 (CHEMBL1059899)
IC50 17±n/a nM
Citation Kobayashi, KTsujita, TIto, HOzaki, STani, TIshii, YOkuda, STadano, KFukuroda, TOhta, HOkamoto, O Identification of MK-1925: a selective, orally active and brain-penetrable opioid receptor-like 1 (ORL1) antagonist. Bioorg Med Chem Lett19:4729-32 (2009) 
 
Nociceptin receptor
Name:Nociceptin receptor
Type:G Protein-Coupled Receptor (GPCR)
Mol. Mass.:40702.87
Organism:Homo sapiens (Human)
Description:P41146
Residue:370
BDBM50296587
NameBDBM50296587
Synonyms:(1S,3R)-N-((5-(3-chloro-5-fluorophenyl)-1,4-dimethyl-1H-pyrazol-3-yl)methyl)-3-fluorocyclopentanamine | CHEMBL563686
TypeSmall organic molecule
Emp. Form.C17H20ClF2N3
Mol. Mass.339.811
SMILESCc1c(CN[C@H]2CC[C@@H](F)C2)nn(C)c1-c1cc(F)cc(Cl)c1