Reaction Details
TargetNociceptin receptor
LigandBDBM50296593
Substrate/Competitorn/a
Meas. Tech.ChEMBL_582239 (CHEMBL1059899)
IC50 15±n/a nM
Citation Kobayashi, KTsujita, TIto, HOzaki, STani, TIshii, YOkuda, STadano, KFukuroda, TOhta, HOkamoto, O Identification of MK-1925: a selective, orally active and brain-penetrable opioid receptor-like 1 (ORL1) antagonist. Bioorg Med Chem Lett19:4729-32 (2009) 
 
Nociceptin receptor
Name:Nociceptin receptor
Type:G Protein-Coupled Receptor (GPCR)
Mol. Mass.:40702.87
Organism:Homo sapiens (Human)
Description:P41146
Residue:370
BDBM50296593
NameBDBM50296593
Synonyms:2-(5-(3,5-difluorophenyl)-3-(((1S,3R)-3-fluorocyclopentylamino)methyl)-4-methyl-1H-pyrazol-1-yl)ethanol | CHEMBL555354
TypeSmall organic molecule
Emp. Form.C18H22F3N3O
Mol. Mass.353.382
SMILESCc1c(CN[C@H]2CC[C@@H](F)C2)nn(CCO)c1-c1cc(F)cc(F)c1