Reaction Details
TargetProstaglandin D2 receptor 2
LigandBDBM50296856
Substrate/Competitorn/a
Meas. Tech.ChEMBL_582681 (CHEMBL1051055)
Ki 619±n/a nM
Citation Sandham, DAAdcock, CBala, KBarker, LBrown, ZDubois, GBudd, DCox, BFairhurst, RAFuregati, MLeblanc, CManini, JProfit, RReilly, JStringer, RSchmidt, ATurner, KLWatson, SJWillis, JWilliams, GWilson, C 7-Azaindole-3-acetic acid derivatives: potent and selective CRTh2 receptor antagonists. Bioorg Med Chem Lett19:4794-8 (2009) 
 
Prostaglandin D2 receptor 2
Name:Prostaglandin D2 receptor 2
Type:Enzyme
Mol. Mass.:43295.45
Organism:Homo sapiens (Human)
Description:Q9Y5Y4
Residue:395
BDBM50296856
NameBDBM50296856
Synonyms:2-(2-methyl-1-tosyl-1H-pyrrolo[2,3-b]pyridin-3-yl)acetic acid | CHEMBL561942
TypeSmall organic molecule
Emp. Form.C17H16N2O4S
Mol. Mass.344.385
SMILESCc1c(CC(O)=O)c2cccnc2n1S(=O)(=O)c1ccc(C)cc1