Reaction Details
TargetProstaglandin D2 receptor 2
LigandBDBM50296845
Substrate/Competitorn/a
Meas. Tech.ChEMBL_582681 (CHEMBL1051055)
Ki 158±n/a nM
Citation Sandham, DAAdcock, CBala, KBarker, LBrown, ZDubois, GBudd, DCox, BFairhurst, RAFuregati, MLeblanc, CManini, JProfit, RReilly, JStringer, RSchmidt, ATurner, KLWatson, SJWillis, JWilliams, GWilson, C 7-Azaindole-3-acetic acid derivatives: potent and selective CRTh2 receptor antagonists. Bioorg Med Chem Lett19:4794-8 (2009) 
 
Prostaglandin D2 receptor 2
Name:Prostaglandin D2 receptor 2
Type:Enzyme
Mol. Mass.:43295.45
Organism:Homo sapiens (Human)
Description:Q9Y5Y4
Residue:395
BDBM50296845
NameBDBM50296845
Synonyms:2-(1-(3-chloro-4-fluorophenylsulfonyl)-2-methyl-1H-pyrrolo[2,3-b]pyridin-3-yl)acetic acid | CHEMBL551274
TypeSmall organic molecule
Emp. Form.C16H12ClFN2O4S
Mol. Mass.382.794
SMILESCc1c(CC(O)=O)c2cccnc2n1S(=O)(=O)c1ccc(F)c(Cl)c1