Reaction Details
TargetProstaglandin D2 receptor 2
LigandBDBM50296846
Substrate/Competitorn/a
Meas. Tech.ChEMBL_582698 (CHEMBL1051072)
IC50 91±n/a nM
Citation Sandham, DAAdcock, CBala, KBarker, LBrown, ZDubois, GBudd, DCox, BFairhurst, RAFuregati, MLeblanc, CManini, JProfit, RReilly, JStringer, RSchmidt, ATurner, KLWatson, SJWillis, JWilliams, GWilson, C 7-Azaindole-3-acetic acid derivatives: potent and selective CRTh2 receptor antagonists. Bioorg Med Chem Lett19:4794-8 (2009) 
 
Prostaglandin D2 receptor 2
Name:Prostaglandin D2 receptor 2
Type:Enzyme
Mol. Mass.:43295.45
Organism:Homo sapiens (Human)
Description:Q9Y5Y4
Residue:395
BDBM50296846
NameBDBM50296846
Synonyms:2-(1-(4-fluoro-3-methoxyphenylsulfonyl)-2-methyl-1H-pyrrolo[2,3-b]pyridin-3-yl)acetic acid | CHEMBL562339
TypeSmall organic molecule
Emp. Form.C17H15FN2O5S
Mol. Mass.378.375
SMILESCOc1cc(ccc1F)S(=O)(=O)n1c(C)c(CC(O)=O)c2cccnc12