Reaction Details
TargetProto-oncogene tyrosine-protein kinase ROS
LigandBDBM50296896
Substrate/Competitorn/a
Meas. Tech.ChEMBL_580685 (CHEMBL1057208)
IC50 199±n/a nM
Citation Park, BSEl-Deeb, IMYoo, KHOh, CHCho, SJHan, DKLee, HSLee, JYLee, SH Design, synthesis and biological evaluation of new potent and highly selective ROS1-tyrosine kinase inhibitor. Bioorg Med Chem Lett19:4720-3 (2009) 
 
Proto-oncogene tyrosine-protein kinase ROS
Name:Proto-oncogene tyrosine-protein kinase ROS
Type:Enzyme
Mol. Mass.:263897.39
Organism:Homo sapiens (Human)
Description:P08922
Residue:2347
BDBM50296896
NameBDBM50296896
Synonyms:(S)-2-(3-(3-hydroxy-5-methylphenyl)-4-(6-(2-hydroxypropylamino)-2-(pyridin-3-yl)pyrimidin-4-yl)-1H-pyrazol-1-yl)acetonitrile | CHEMBL560733
TypeSmall organic molecule
Emp. Form.C24H23N7O2
Mol. Mass.441.4851
SMILESC[C@H](O)CNc1cc(nc(n1)-c1cccnc1)-c1cn(CC#N)nc1-c1cc(C)cc(O)c1