Reaction Details
TargetMAP kinase-activated protein kinase 2
LigandBDBM50297119
Substrate/Competitorn/a
Meas. Tech.ChEMBL_581771 (CHEMBL1061558)
IC50 5±n/a nM
Citation Anderson, DRMeyers, MJKurumbail, RGCaspers, NPoda, GILong, SAPierce, BSMahoney, MWMourey, RJParikh, MD Benzothiophene inhibitors of MK2. Part 2: improvements in kinase selectivity and cell potency. Bioorg Med Chem Lett19:4882-4 (2009) 
 
MAP kinase-activated protein kinase 2
Name:MAP kinase-activated protein kinase 2
Type:Serine/threonine-protein kinase
Mol. Mass.:45579.87
Organism:Homo sapiens (Human)
Description:P49137
Residue:400
BDBM50297119
NameBDBM50297119
Synonyms:(R)-10-Methyl-3-(4-methyl-pyridin-3-yl)-9,10,11,12-tetrahydro-7-thia-4,9,12-triaza-naphtho[1,2-a]azulen-8-one | CHEMBL549915
TypeSmall organic molecule
Emp. Form.C21H18N4OS
Mol. Mass.374.459
SMILESC[C@@H]1CNc2c(sc3ccc4nc(ccc4c23)-c2cnccc2C)C(=O)N1