Reaction Details
TargetMAP kinase-activated protein kinase 2
LigandBDBM50297151
Substrate/Competitorn/a
Meas. Tech.ChEMBL_581801 (CHEMBL1063346)
IC50 2600±n/a nM
Citation Anderson, DRMeyers, MJKurumbail, RGCaspers, NPoda, GILong, SAPierce, BSMahoney, MWMourey, RJ Benzothiophene inhibitors of MK2. Part 1: structure-activity relationships, assessments of selectivity and cellular potency. Bioorg Med Chem Lett19:4878-81 (2009) 
 
MAP kinase-activated protein kinase 2
Name:MAP kinase-activated protein kinase 2
Type:Serine/threonine-protein kinase
Mol. Mass.:45579.87
Organism:Homo sapiens (Human)
Description:P49137
Residue:400
BDBM50297151
NameBDBM50297151
Synonyms:(3R)-3-(aminomethyl)-9-methoxy-1,2,3,4-tetrahydro-5H-[1]benzothieno[3,2-e][1,4]diazepin-5-one CHEMBL555205
TypeSmall organic molecule
Emp. Form.C13H15N3O2S
Mol. Mass.277.342
SMILESCOc1ccc2sc3c(NC[C@@H](CN)NC3=O)c2c1